What is INSTALL_PARSE_FAILED_NO_CERTIFICATES error??

I was trying to change my default/main/startup (whatever you call it) activity by editing the androidmanifest.xml fi...

What is INSTALL_PARSE_FAILED_NO_CERTIFICATES error??

I was trying to change my default/main/startup (whatever you call it) activity by editing the androidmanifest.xml fi...

What is INSTALL_PARSE_FAILED_NO_CERTIFICATES error??

I was trying to change my default/main/startup (whatever you call it) activity by editing the androidmanifest.xml fi...

Error: EACCES: permission denied, access '/usr/local/lib/node_modules' react?

What might be causing the error Error: EACCES: permission denied, access '/usr/local/lib/node_modules'? npm ERR! pa...

Error: EACCES: permission denied, access '/usr/local/lib/node_modules' react?

What might be causing the error Error: EACCES: permission denied, access '/usr/local/lib/node_modules'? npm ERR! pa...

DistutilsOptionError: must supply either home or prefix/exec-prefix — not both?

I've been usually installed python packages through pip. For Google App Engine, I need to install packages to anoth...

gradlew command not found??

I am working on a Java project with gradlew. I use Ubuntu Linux as my OS. When I run "gradle" it runs, and gives me ...

Why does “pip install” inside Python raise a SyntaxError??

I'm trying to use pip to install a package. I try to run pip install from the Python shell, but I get a SyntaxError...

pip installation /usr/local/opt/python/bin/python2.7: bad interpreter: No such file or directory?

I don't know what's the deal but I am stuck following some stackoverflow solutions which gets nowhere. Can you pleas...

What are the specific differences between .msi and setup.exe file??

I searched a lot, but all are guessed answers. Help me to find the exact answer. ...

Xampp MySQL not starting - “Attempting to start MySQL service…”?

I've just installed XAMPP for Windows - should be the newest version (XAMPP Control Panel v3.2.1). Apache is runni...

Error 1334 .File cannot be found in the Data1.cab?

I am working on a Win 7-64 bit machine. I have a software installation package which contains the .msi file, a CAB f...

lib unspecified & Error in loadNamespace?

I had everything working with R and RStudio, but then I moved the folders when cleaning up my computer directories &...

SKLearn 0.20.2 - Import error with RandomizedPCA??

I'm trying to do the Udacity mini project and I've got the latest version of the SKLearn library installed (20.2). ...